BDBM393524 US9969687, Compound 189
SMILES COc1cc[n+]([O-])cc1N1C(=O)c2c(C1=O)c(NS(=O)(=O)c1ccc(cc1)C(C)(C)C)ccc2Cl
InChI Key InChIKey=MQTSXQVIGRMZMD-UHFFFAOYSA-N
Data  1 KI
  Tab Delimited (TSV)   2D SDfile   Computed 3D by Vconf -m prep SDfile
Find this compound or compounds like it in BindingDB:
Activity Spreadsheet -- Enzyme Inhibition Constant Data from BindingDB
Found 1 hit for monomerid = 393524
TargetC-C chemokine receptor type 9(Homo sapiens (Human))
Norgine
US Patent
LigandPNGBDBM393524(US9969687, Compound 189)
Affinity DataKi:  34nM. Assay description: A calcium flux assay was used to determine the ability of the compounds to interfere with the binding between CCR9 and its chemokine ligand (TECK) in...
Ligand InfoPC cidPC sid
In DepthDetails US Patent