BDBM393645 US9969723, 27
SMILES CC#C[C@@H](CC(O)=O)c1ccc(OCc2ccc(CN3Cc4ccccc4C3)cc2)cc1
InChI Key InChIKey=LERULKZHANTCLJ-DEOSSOPVSA-N
Data  1 EC50
  Tab Delimited (TSV)   2D SDfile   Computed 3D by Vconf -m prep SDfile
Find this compound or compounds like it in BindingDB:
Activity Spreadsheet -- Enzyme Inhibition Constant Data from BindingDB
Found 1 hit for monomerid = 393645
TargetFree fatty acid receptor 1(Homo sapiens (Human))
Hyundai Pharm
US Patent
LigandPNGBDBM393645(US9969723, 27)
Affinity DataEC50: <200nM. Assay description: The GPR40 protein activity according to the novel 3-(4-(benzyloxy)phenyl)hex-4-inoic acid derivative of the present invention was measured by investi...
Ligand InfoPC cidPC sid
In DepthDetails US Patent