BDBM393719 (R)—N-(1-(3-Amino-4-chloroisoxazolo[5,4-c]pyridin-7-yl)pyrrolidin-3-yl)-2-chloro-4-(9H-purin-9-yl)benzamide::US9969724, Example 48
SMILES Nc1noc2c(ncc(Cl)c12)N1CC[C@H](C1)NC(=O)c1ccc(cc1Cl)-n1cnc2cncnc12
InChI Key InChIKey=OHOMAQXLUPCNQN-LLVKDONJSA-N
Data  1 IC50
  Tab Delimited (TSV)   2D SDfile   Computed 3D by Vconf -m prep SDfile
Find this compound or compounds like it in BindingDB:
Activity Spreadsheet -- Enzyme Inhibition Constant Data from BindingDB
Found 1 hit for monomerid = 393719
TargetCoagulation factor IX(Homo sapiens (Human))
Merck Sharp & Dohme
US Patent
LigandPNGBDBM393719((R)—N-(1-(3-Amino-4-chloroisoxazolo[5,4-c]pyridin-...)
Affinity DataIC50: <100nM. Assay description: Inhibitory activity against factor IXa was tested using the substrate SPECTROFLUOR FIXa (american diagnostica inc.; 500 West Avenue, Stamford, Conn. ...
Ligand InfoPC cidPC sid
In DepthDetails US Patent