BDBM393723 (R)—N-(1-(3-Amino-4-chloroisoxazolo[5,4-c]pyridin-7-yl)pyrrolidin-3-yl)-3-chloro-5-(3-methyl-1H-1,2,4-triazol-1-yl)picolinamide::US9969724, Example 52
SMILES Cc1ncn(n1)-c1cnc(C(=O)N[C@@H]2CCN(C2)c2ncc(Cl)c3c(N)noc23)c(Cl)c1
InChI Key InChIKey=JAUBDTZVKKVEQB-SNVBAGLBSA-N
Data  1 IC50
  Tab Delimited (TSV)   2D SDfile   Computed 3D by Vconf -m prep SDfile
Find this compound or compounds like it in BindingDB:
Activity Spreadsheet -- Enzyme Inhibition Constant Data from BindingDB
Found 1 hit for monomerid = 393723
TargetCoagulation factor IX(Homo sapiens (Human))
Merck Sharp & Dohme
US Patent
LigandPNGBDBM393723((R)—N-(1-(3-Amino-4-chloroisoxazolo[5,4-c]pyridin-...)
Affinity DataIC50:  550nM. Assay description: Inhibitory activity against factor IXa was tested using the substrate SPECTROFLUOR FIXa (american diagnostica inc.; 500 West Avenue, Stamford, Conn. ...
Ligand InfoPC cidPC sid
In DepthDetails US Patent