BDBM393746 US10597367, Example 36::US9969726, Example 36
SMILES C(=C/c1ccccc1)\c1nc(cs1)-c1cccc(c1)-c1ccccc1
InChI Key InChIKey=IPGIHKHYLNKWPF-CCEZHUSRSA-N
Data  8 EC50
  Tab Delimited (TSV)   2D SDfile   Computed 3D by Vconf -m prep SDfile
Find this compound or compounds like it in BindingDB:
Activity Spreadsheet -- Enzyme Inhibition Constant Data from BindingDB
Found 8 hits for monomerid = 393746
TargetMetabotropic glutamate receptor 2(Rattus norvegicus)
Sanford-Burnham Medical Research Institute
US Patent
LigandPNGBDBM393746(US10597367, Example 36 | US9969726, Example 36)
Affinity DataEC50:  3.47E+3nM. Assay description: Human Embryonic Kidney (HEK-293) cell lines co-expressing rat mGlu receptors 2, 3, 4, 6, 7 or 8 and G protein-coupled inwardly-rectifying potassium (...
Ligand InfoPC cidPC sid
In DepthDetails US Patent
TargetMetabotropic glutamate receptor 2(Rattus norvegicus)
Sanford-Burnham Medical Research Institute
US Patent
LigandPNGBDBM393746(US10597367, Example 36 | US9969726, Example 36)
Affinity DataEC50: >1.00E+4nM. Assay description: Human Embryonic Kidney (HEK-293) cell lines co-expressing rat mGlu receptors 2, 3, 4, 6, 7 or 8 and G protein-coupled inwardly-rectifying potassium (...
Ligand InfoPC cidPC sid
In DepthDetails US Patent
TargetMetabotropic glutamate receptor 3(Rattus norvegicus (Rat))
Sanford-Burnham Medical Research Institute
US Patent
LigandPNGBDBM393746(US10597367, Example 36 | US9969726, Example 36)
Affinity DataEC50: >1.00E+4nM. Assay description: Human Embryonic Kidney (HEK-293) cell lines co-expressing rat mGlu receptors 2, 3, 4, 6, 7 or 8 and G protein-coupled inwardly-rectifying potassium (...
Ligand InfoPC cidPC sid
In DepthDetails US Patent
TargetMetabotropic glutamate receptor 5(Rattus norvegicus (Rat))
Sanford Burnham Prebys Medical Discovery Institute
US Patent
LigandPNGBDBM393746(US10597367, Example 36 | US9969726, Example 36)
Affinity DataEC50: >1.00E+4nM. Assay description: Human Embryonic Kidney (HEK-293) cell lines co-expressing rat mGlu receptors 2, 3, 4, 6, 7 or 8 and G protein-coupled inwardly-rectifying potassium (...
Ligand InfoPC cidPC sid
In DepthDetails US Patent
TargetMetabotropic glutamate receptor 2(Rattus norvegicus)
Sanford-Burnham Medical Research Institute
US Patent
LigandPNGBDBM393746(US10597367, Example 36 | US9969726, Example 36)
Affinity DataEC50:  3.47E+3nM. Assay description: Human Embryonic Kidney (HEK-293) cell lines co-expressing rat mGlu receptors 2, 3, 4, 6, 7 or 8 and G protein-coupled inwardly-rectifying potassium (...
Ligand InfoPC cidPC sid
In DepthDetails US Patent
TargetMetabotropic glutamate receptor 2(Rattus norvegicus)
Sanford-Burnham Medical Research Institute
US Patent
LigandPNGBDBM393746(US10597367, Example 36 | US9969726, Example 36)
Affinity DataEC50: >1.00E+4nM. Assay description: Human Embryonic Kidney (HEK-293) cell lines co-expressing rat mGlu receptors 2, 3, 4, 6, 7 or 8 and G protein-coupled inwardly-rectifying potassium (...
Ligand InfoPC cidPC sid
In DepthDetails US Patent
TargetMetabotropic glutamate receptor 5(Rattus norvegicus (Rat))
Sanford Burnham Prebys Medical Discovery Institute
US Patent
LigandPNGBDBM393746(US10597367, Example 36 | US9969726, Example 36)
Affinity DataEC50: >1.00E+4nM. Assay description: Human Embryonic Kidney (HEK-293) cell lines co-expressing rat mGlu receptors 2, 3, 4, 6, 7 or 8 and G protein-coupled inwardly-rectifying potassium (...
Ligand InfoPC cidPC sid
In DepthDetails US Patent
TargetMetabotropic glutamate receptor 3(Rattus norvegicus (Rat))
Sanford-Burnham Medical Research Institute
US Patent
LigandPNGBDBM393746(US10597367, Example 36 | US9969726, Example 36)
Affinity DataEC50: >1.00E+4nM. Assay description: Human Embryonic Kidney (HEK-293) cell lines co-expressing rat mGlu receptors 2, 3, 4, 6, 7 or 8 and G protein-coupled inwardly-rectifying potassium (...
Ligand InfoPC cidPC sid
In DepthDetails US Patent