BDBM393793 US10597367, Example 82::US9969726, Example 82
SMILES OC(=O)c1cc(ccc1F)-c1ccc(cc1)-c1nc(cc(n1)C(F)(F)F)-c1ccc(nc1)C(F)(F)F
InChI Key InChIKey=KAOFMCAYAKVEQG-UHFFFAOYSA-N
Data  8 EC50
  Tab Delimited (TSV)   2D SDfile   Computed 3D by Vconf -m prep SDfile
Find this compound or compounds like it in BindingDB:
Activity Spreadsheet -- Enzyme Inhibition Constant Data from BindingDB
Found 8 hits for monomerid = 393793
TargetMetabotropic glutamate receptor 2(Rattus norvegicus)
Sanford-Burnham Medical Research Institute
US Patent
LigandPNGBDBM393793(US10597367, Example 82 | US9969726, Example 82)
Affinity DataEC50:  1.42E+3nM. Assay description: Human Embryonic Kidney (HEK-293) cell lines co-expressing rat mGlu receptors 2, 3, 4, 6, 7 or 8 and G protein-coupled inwardly-rectifying potassium (...
Ligand InfoPC cidPC sid
In DepthDetails US Patent
TargetMetabotropic glutamate receptor 2(Rattus norvegicus)
Sanford-Burnham Medical Research Institute
US Patent
LigandPNGBDBM393793(US10597367, Example 82 | US9969726, Example 82)
Affinity DataEC50:  490nM. Assay description: Human Embryonic Kidney (HEK-293) cell lines co-expressing rat mGlu receptors 2, 3, 4, 6, 7 or 8 and G protein-coupled inwardly-rectifying potassium (...
Ligand InfoPC cidPC sid
In DepthDetails US Patent
TargetMetabotropic glutamate receptor 3(Rattus norvegicus (Rat))
Sanford-Burnham Medical Research Institute
US Patent
LigandPNGBDBM393793(US10597367, Example 82 | US9969726, Example 82)
Affinity DataEC50:  1.32E+3nM. Assay description: Human Embryonic Kidney (HEK-293) cell lines co-expressing rat mGlu receptors 2, 3, 4, 6, 7 or 8 and G protein-coupled inwardly-rectifying potassium (...
Ligand InfoPC cidPC sid
In DepthDetails US Patent
TargetMetabotropic glutamate receptor 5(Rattus norvegicus (Rat))
Sanford Burnham Prebys Medical Discovery Institute
US Patent
LigandPNGBDBM393793(US10597367, Example 82 | US9969726, Example 82)
Affinity DataEC50:  530nM. Assay description: Human Embryonic Kidney (HEK-293) cell lines co-expressing rat mGlu receptors 2, 3, 4, 6, 7 or 8 and G protein-coupled inwardly-rectifying potassium (...
Ligand InfoPC cidPC sid
In DepthDetails US Patent
TargetMetabotropic glutamate receptor 2(Rattus norvegicus)
Sanford-Burnham Medical Research Institute
US Patent
LigandPNGBDBM393793(US10597367, Example 82 | US9969726, Example 82)
Affinity DataEC50:  1.42E+3nM. Assay description: Human Embryonic Kidney (HEK-293) cell lines co-expressing rat mGlu receptors 2, 3, 4, 6, 7 or 8 and G protein-coupled inwardly-rectifying potassium (...
Ligand InfoPC cidPC sid
In DepthDetails US Patent
TargetMetabotropic glutamate receptor 2(Rattus norvegicus)
Sanford-Burnham Medical Research Institute
US Patent
LigandPNGBDBM393793(US10597367, Example 82 | US9969726, Example 82)
Affinity DataEC50:  490nM. Assay description: Human Embryonic Kidney (HEK-293) cell lines co-expressing rat mGlu receptors 2, 3, 4, 6, 7 or 8 and G protein-coupled inwardly-rectifying potassium (...
Ligand InfoPC cidPC sid
In DepthDetails US Patent
TargetMetabotropic glutamate receptor 5(Rattus norvegicus (Rat))
Sanford Burnham Prebys Medical Discovery Institute
US Patent
LigandPNGBDBM393793(US10597367, Example 82 | US9969726, Example 82)
Affinity DataEC50:  1.32E+3nM. Assay description: Human Embryonic Kidney (HEK-293) cell lines co-expressing rat mGlu receptors 2, 3, 4, 6, 7 or 8 and G protein-coupled inwardly-rectifying potassium (...
Ligand InfoPC cidPC sid
In DepthDetails US Patent
TargetMetabotropic glutamate receptor 3(Rattus norvegicus (Rat))
Sanford-Burnham Medical Research Institute
US Patent
LigandPNGBDBM393793(US10597367, Example 82 | US9969726, Example 82)
Affinity DataEC50:  530nM. Assay description: Human Embryonic Kidney (HEK-293) cell lines co-expressing rat mGlu receptors 2, 3, 4, 6, 7 or 8 and G protein-coupled inwardly-rectifying potassium (...
Ligand InfoPC cidPC sid
In DepthDetails US Patent