BDBM393797 US10597367, Example 86::US9969726, Example 86
SMILES OC(=O)c1cc(ccc1F)-c1cccc(c1)-c1nc(cc(n1)C(F)(F)F)-c1ccccc1
InChI Key InChIKey=BQHCZMXQSGJIBS-UHFFFAOYSA-N
Data  8 EC50
  Tab Delimited (TSV)   2D SDfile   Computed 3D by Vconf -m prep SDfile
Find this compound or compounds like it in BindingDB:
Activity Spreadsheet -- Enzyme Inhibition Constant Data from BindingDB
Found 8 hits for monomerid = 393797
TargetMetabotropic glutamate receptor 2(Rattus norvegicus)
Sanford-Burnham Medical Research Institute
US Patent
LigandPNGBDBM393797(US10597367, Example 86 | US9969726, Example 86)
Affinity DataEC50:  800nM. Assay description: Human Embryonic Kidney (HEK-293) cell lines co-expressing rat mGlu receptors 2, 3, 4, 6, 7 or 8 and G protein-coupled inwardly-rectifying potassium (...
Ligand InfoPC cidPC sid
In DepthDetails US Patent
TargetMetabotropic glutamate receptor 2(Rattus norvegicus)
Sanford-Burnham Medical Research Institute
US Patent
LigandPNGBDBM393797(US10597367, Example 86 | US9969726, Example 86)
Affinity DataEC50:  40nM. Assay description: Human Embryonic Kidney (HEK-293) cell lines co-expressing rat mGlu receptors 2, 3, 4, 6, 7 or 8 and G protein-coupled inwardly-rectifying potassium (...
Ligand InfoPC cidPC sid
In DepthDetails US Patent
TargetMetabotropic glutamate receptor 3(Rattus norvegicus (Rat))
Sanford-Burnham Medical Research Institute
US Patent
LigandPNGBDBM393797(US10597367, Example 86 | US9969726, Example 86)
Affinity DataEC50:  920nM. Assay description: Human Embryonic Kidney (HEK-293) cell lines co-expressing rat mGlu receptors 2, 3, 4, 6, 7 or 8 and G protein-coupled inwardly-rectifying potassium (...
Ligand InfoPC cidPC sid
In DepthDetails US Patent
TargetMetabotropic glutamate receptor 5(Rattus norvegicus (Rat))
Sanford Burnham Prebys Medical Discovery Institute
US Patent
LigandPNGBDBM393797(US10597367, Example 86 | US9969726, Example 86)
Affinity DataEC50:  120nM. Assay description: Human Embryonic Kidney (HEK-293) cell lines co-expressing rat mGlu receptors 2, 3, 4, 6, 7 or 8 and G protein-coupled inwardly-rectifying potassium (...
Ligand InfoPC cidPC sid
In DepthDetails US Patent
TargetMetabotropic glutamate receptor 2(Rattus norvegicus)
Sanford-Burnham Medical Research Institute
US Patent
LigandPNGBDBM393797(US10597367, Example 86 | US9969726, Example 86)
Affinity DataEC50:  800nM. Assay description: Human Embryonic Kidney (HEK-293) cell lines co-expressing rat mGlu receptors 2, 3, 4, 6, 7 or 8 and G protein-coupled inwardly-rectifying potassium (...
Ligand InfoPC cidPC sid
In DepthDetails US Patent
TargetMetabotropic glutamate receptor 2(Rattus norvegicus)
Sanford-Burnham Medical Research Institute
US Patent
LigandPNGBDBM393797(US10597367, Example 86 | US9969726, Example 86)
Affinity DataEC50:  40nM. Assay description: Human Embryonic Kidney (HEK-293) cell lines co-expressing rat mGlu receptors 2, 3, 4, 6, 7 or 8 and G protein-coupled inwardly-rectifying potassium (...
Ligand InfoPC cidPC sid
In DepthDetails US Patent
TargetMetabotropic glutamate receptor 5(Rattus norvegicus (Rat))
Sanford Burnham Prebys Medical Discovery Institute
US Patent
LigandPNGBDBM393797(US10597367, Example 86 | US9969726, Example 86)
Affinity DataEC50:  920nM. Assay description: Human Embryonic Kidney (HEK-293) cell lines co-expressing rat mGlu receptors 2, 3, 4, 6, 7 or 8 and G protein-coupled inwardly-rectifying potassium (...
Ligand InfoPC cidPC sid
In DepthDetails US Patent
TargetMetabotropic glutamate receptor 3(Rattus norvegicus (Rat))
Sanford-Burnham Medical Research Institute
US Patent
LigandPNGBDBM393797(US10597367, Example 86 | US9969726, Example 86)
Affinity DataEC50:  120nM. Assay description: Human Embryonic Kidney (HEK-293) cell lines co-expressing rat mGlu receptors 2, 3, 4, 6, 7 or 8 and G protein-coupled inwardly-rectifying potassium (...
Ligand InfoPC cidPC sid
In DepthDetails US Patent