BDBM393922 US9969749, Example 1-16::trans-N,N-dimethyl-N'- {6-[1-(tetrahydro-2H- pyran-2-yl)-1H-pyrazol- 4-yl]quinazolin-4- yl}cyclohexane-1,4- diamine
SMILES CN(C)[C@H]1CC[C@@H](CC1)Nc1ncnc2ccc(cc12)C(\C=N)=C\NC1CCCCO1
InChI Key InChIKey=JHEULMOLHSGMLP-MDGUKVRBSA-N
Data  1 IC50
  Tab Delimited (TSV)   2D SDfile   Computed 3D by Vconf -m prep SDfile
Find this compound or compounds like it in BindingDB:
Activity Spreadsheet -- Enzyme Inhibition Constant Data from BindingDB
Found 1 hit for monomerid = 393922
TargetInterleukin-1 receptor-associated kinase 4(Homo sapiens (Human))
Merck Sharp & Dohme
US Patent
LigandPNGBDBM393922(US9969749, Example 1-16 | trans-N,N-dimethyl-N'- {...)
Affinity DataIC50:  217nM. Assay description: The kinase activity of IRAK4 is determined by its ability to catalyze the phosphorylation of a fluorescent polypeptide substrate. The extent of phosp...
Ligand InfoPC cidPC sid
In DepthDetails US Patent