BDBM393961 US9969743, 55
SMILES CC(C)(C)c1nc(cc(n1)C(F)(F)F)N1CCN(CCCCNC(=O)N2CCc3c(C2)[nH]c2ccccc32)CC1
InChI Key InChIKey=JWWLBNFBBLUIHS-UHFFFAOYSA-N
Data  2 KI
  Tab Delimited (TSV)   2D SDfile   Computed 3D by Vconf -m prep SDfile
Find this compound or compounds like it in BindingDB:
Activity Spreadsheet -- Enzyme Inhibition Constant Data from BindingDB
Found 2 hits for monomerid = 393961
TargetD(3) dopamine receptor(Homo sapiens (Human))
Southern Research Institute
US Patent
LigandPNGBDBM393961(US9969743, 55)
Affinity DataKi:  3nM. Assay description: Stably transfected HEK cells expressing the human D2-long and the D3 dopamine receptor were developed using the pIRESneo2 bicistronic expression vect...
Ligand InfoPC cidPC sid
In DepthDetails US Patent
TargetD(2) dopamine receptor(Homo sapiens (Human))
Southern Research Institute
US Patent
LigandPNGBDBM393961(US9969743, 55)
Affinity DataKi:  536nM. Assay description: Stably transfected HEK cells expressing the human D2-long and the D3 dopamine receptor were developed using the pIRESneo2 bicistronic expression vect...
Ligand InfoPC cidPC sid
In DepthDetails US Patent