BDBM393969 US9969749, Example 1-60::trans-N,N-dimethyl-N'- [6-(3-methyl-3H- imidazo[4,5-b]pyridin- 6-yl)quinazolin-4- yl]cyclohexane-1,4- diamine
SMILES CN(C)[C@H]1CC[C@@H](CC1)Nc1ncnc2ccc(cc12)-c1cnc2n(C)cnc2c1
InChI Key InChIKey=WYQBKUXVYOAAGX-IYARVYRRSA-N
Data  1 IC50
  Tab Delimited (TSV)   2D SDfile   Computed 3D by Vconf -m prep SDfile
Find this compound or compounds like it in BindingDB:
Activity Spreadsheet -- Enzyme Inhibition Constant Data from BindingDB
Found 1 hit for monomerid = 393969
TargetInterleukin-1 receptor-associated kinase 4(Homo sapiens (Human))
Merck Sharp & Dohme
US Patent
LigandPNGBDBM393969(US9969749, Example 1-60 | trans-N,N-dimethyl-N'- [...)
Affinity DataIC50:  1.69E+3nM. Assay description: The kinase activity of IRAK4 is determined by its ability to catalyze the phosphorylation of a fluorescent polypeptide substrate. The extent of phosp...
Ligand InfoPC cidPC sid
In DepthDetails US Patent