BDBM393970 US9969749, Example 1-61::trans-N'-[6-(furo[3,2- b]pyridin-6- yl)quinazolin-4-yl]-N,N- dimethylcyclohexane- 1,4-diamine
SMILES CN(C)[C@H]1CC[C@@H](CC1)Nc1ncnc2ccc(cc12)-c1cnc2ccoc2c1
InChI Key InChIKey=ZCQVUKNBGUAXJR-IYARVYRRSA-N
Data  1 IC50
  Tab Delimited (TSV)   2D SDfile   Computed 3D by Vconf -m prep SDfile
Find this compound or compounds like it in BindingDB:
Activity Spreadsheet -- Enzyme Inhibition Constant Data from BindingDB
Found 1 hit for monomerid = 393970
TargetInterleukin-1 receptor-associated kinase 4(Homo sapiens (Human))
Merck Sharp & Dohme
US Patent
LigandPNGBDBM393970(US9969749, Example 1-61 | trans-N'-[6-(furo[3,2- b...)
Affinity DataIC50:  109nM. Assay description: The kinase activity of IRAK4 is determined by its ability to catalyze the phosphorylation of a fluorescent polypeptide substrate. The extent of phosp...
Ligand InfoPC cidPC sid
In DepthDetails US Patent