BDBM394104 US9974785, Example 25
SMILES FC(F)c1cn(c2cc(Cl)cc(N3CCNCC3)c12)S(=O)(=O)c1ccccc1Cl
InChI Key InChIKey=LCLHOHAXTDTXMZ-UHFFFAOYSA-N
Data  1 KI
  Tab Delimited (TSV)   2D SDfile   Computed 3D by Vconf -m prep SDfile
Find this compound or compounds like it in BindingDB:
Activity Spreadsheet -- Enzyme Inhibition Constant Data from BindingDB
Found 1 hit for monomerid = 394104
Target5-hydroxytryptamine receptor 6(Homo sapiens (Human))
Sunshine Lake Pharma
US Patent
LigandPNGBDBM394104(US9974785, Example 25)
Affinity DataKi:  0.680nM. Assay description: 32 μg membrane proteins of CHO cell expressing human 5-HT6 receptor, 2 nM of radioactive marker [3H]LSD, a compound of the present invention hav...
Ligand InfoPC cidPC sid
In DepthDetails US Patent