BDBM394126 US9975861, 6
SMILES CCCNC1=NC(NC(=O)N1)c1ccc(F)cc1
InChI Key InChIKey=XVEHHNNZSPUUFR-UHFFFAOYSA-N
Data  2 IC50
  Tab Delimited (TSV)   2D SDfile   Computed 3D by Vconf -m prep SDfile
Find this compound or compounds like it in BindingDB:
Activity Spreadsheet -- Enzyme Inhibition Constant Data from BindingDB
Found 2 hits for monomerid = 394126
TargetGlycogen synthase kinase-3 beta(Homo sapiens (Human))
Fondazione Istituto Itaiano Di Tecnologia
US Patent
LigandPNGBDBM394126(US9975861, 6)
Affinity DataIC50:  4.34E+3nM. Assay description: Human recombinant GSK-3β was purchased from Millipore (Millipore Iberica S.A.U.) The prephosphorylated polypeptide substrate was purchased from ...
Ligand InfoPC cidPC sid
In DepthDetails US Patent
TargetBeta-secretase 1(Homo sapiens (Human))
Fondazione Istituto Itaiano Di Tecnologia
US Patent
LigandPNGBDBM394126(US9975861, 6)
Affinity DataIC50:  3.68E+4nM. Assay description: β-secretase (BACE-1, Sigma-Aldrich) inhibition studies were performed by employing a peptide mimicking APP sequence as substrate (Methoxycoumari...
Ligand InfoPC cidPC sid
In DepthDetails US Patent