BDBM394241 US9975882, Example 32
SMILES CC#CC(=O)N1CC[C@@]2(C[C@@H](C2)n2nc(-c3cnn(Cc4cc(ccc4F)C(F)(F)F)c3)c(C(N)=O)c2N)C1
InChI Key InChIKey=YYRYNQBAVOOSOA-YGFACIEFSA-N
Data  5 IC50
  Tab Delimited (TSV)   2D SDfile   Computed 3D by Vconf -m prep SDfile
Find this compound or compounds like it in BindingDB:
Activity Spreadsheet -- Enzyme Inhibition Constant Data from BindingDB
Found 5 hits for monomerid = 394241
TargetTyrosine-protein kinase BTK(Homo sapiens (Human))
Boehringer Ingelheim International
US Patent
LigandPNGBDBM394241(US9975882, Example 32)
Affinity DataIC50:  0.5nM. Assay description: Lanthscreen Eu Kinase Binding assay for BMX is performed as described above for BTK except that 1 nM human recombinant full length TEC (His-tagged) k...
Ligand InfoPC cidPC sid
In DepthDetails US Patent
TargetTyrosine-protein kinase BTK(Homo sapiens (Human))
Boehringer Ingelheim International
US Patent
LigandPNGBDBM394241(US9975882, Example 32)
Affinity DataIC50:  1.90nM. Assay description: Lanthscreen Eu Kinase Binding assay for BMX is performed as described above for BTK except that 1 nM human recombinant full length TEC (His-tagged) k...
Ligand InfoPC cidPC sid
In DepthDetails US Patent
TargetTyrosine-protein kinase TXK(Homo sapiens (Human))
Boehringer Ingelheim International
US Patent
LigandPNGBDBM394241(US9975882, Example 32)
Affinity DataIC50:  55nM. Assay description: Lanthscreen Eu Kinase Binding assay for BMX is performed as described above for BTK except that 1 nM human recombinant full length TEC (His-tagged) k...
Ligand InfoPC cidPC sid
In DepthDetails US Patent
TargetTyrosine-protein kinase Tec(Homo sapiens (Human))
Boehringer Ingelheim International
US Patent
LigandPNGBDBM394241(US9975882, Example 32)
Affinity DataIC50:  49nM. Assay description: Lanthscreen Eu Kinase Binding assay for BMX is performed as described above for BTK except that 1 nM human recombinant full length TEC (His-tagged) k...
Ligand InfoPC cidPC sid
In DepthDetails US Patent
TargetCytoplasmic tyrosine-protein kinase BMX(Homo sapiens (Human))
Boehringer Ingelheim International
US Patent
LigandPNGBDBM394241(US9975882, Example 32)
Affinity DataIC50:  64nM. Assay description: Lanthscreen Eu Kinase Binding assay for BMX is performed as described above for BTK except that 1 nM human recombinant full length TEC (His-tagged) k...
Ligand InfoPC cidPC sid
In DepthDetails US Patent