BDBM39425 6-(4-Diethylamino-phenyl)-1,3-dimethyl-1,6-dihydro-pyrrolo[3,4-d]pyrimidine-2,4-dione::6-[4-(diethylamino)phenyl]-1,3-dimethyl-pyrrolo[3,4-d]pyrimidine-2,4-dione::6-[4-(diethylamino)phenyl]-1,3-dimethyl-pyrrolo[3,4-d]pyrimidine-2,4-quinone::6-[4-(diethylamino)phenyl]-1,3-dimethylpyrrolo[3,4-d]pyrimidine-2,4-dione::MLS000033618::SMR000013755::cid_648214
SMILES CCN(CC)c1ccc(cc1)-n1cc2n(C)c(=O)n(C)c(=O)c2c1
InChI Key InChIKey=BADKDBZCJFZYDX-UHFFFAOYSA-N
Data  3 EC50
  Tab Delimited (TSV)   2D SDfile   Computed 3D by Vconf -m prep SDfile
Find this compound or compounds like it in BindingDB:
Activity Spreadsheet -- Enzyme Inhibition Constant Data from BindingDB
Found 3 hits for monomerid = 39425
TargetSteroidogenic factor 1(Homo sapiens (Human))
The Scripps Research Institute Molecular Screening Center
Curated by PubChem BioAssay
LigandPNGBDBM39425(6-(4-Diethylamino-phenyl)-1,3-dimethyl-1,6-dihydro...)
Affinity DataEC50:  1.24E+4nM. Assay description: Source (MLSCN Center Name): The Scripps Research Institute Molecular Screening Center Center Affiliation: The Scripps Research Institute, TSRI Assay ...
In DepthDetails PCBioAssay
TargetStreptokinase A(Streptococcus pyogenes M1 GAS)
Broad Institute
Curated by PubChem BioAssay
LigandPNGBDBM39425(6-(4-Diethylamino-phenyl)-1,3-dimethyl-1,6-dihydro...)
Affinity DataEC50:  1.50E+5nM. Assay description: Keywords: Group A streptococcus, GAS, streptokinase, expression, virulence, inhibition, dose response, EC50 Assay Overview: The goal of this assa...
In DepthDetails PCBioAssay
TargetIsoform 2 of Nuclear receptor ROR-alpha (Alpha-2)(Homo sapiens (Human))
The Scripps Research Institute Molecular Screening Center
Curated by PubChem BioAssay
LigandPNGBDBM39425(6-(4-Diethylamino-phenyl)-1,3-dimethyl-1,6-dihydro...)
Affinity DataEC50:  1.25E+4nM. Assay description: Source (MLSCN Center Name): The Scripps Research Institute Molecular Screening Center Center Affiliation: The Scripps Research Institute, TSRI Assay ...
In DepthDetails PCBioAssay