BDBM394265 US9975882, Example 56
SMILES CC#CC(=O)N1CC[C@@]2(C[C@@H](C2)n2nc(-c3cnn(Cc4cccc(F)c4C(F)(F)F)c3)c(C(N)=O)c2N)C1
InChI Key InChIKey=WZLCFQWCRHXUJG-QFMRLBMFSA-N
Data  5 IC50
  Tab Delimited (TSV)   2D SDfile   Computed 3D by Vconf -m prep SDfile
Find this compound or compounds like it in BindingDB:
Activity Spreadsheet -- Enzyme Inhibition Constant Data from BindingDB
Found 5 hits for monomerid = 394265
TargetTyrosine-protein kinase BTK(Homo sapiens (Human))
Boehringer Ingelheim International
US Patent
LigandPNGBDBM394265(US9975882, Example 56)
Affinity DataIC50:  0.600nM. Assay description: Lanthscreen Eu Kinase Binding assay for BMX is performed as described above for BTK except that 1 nM human recombinant full length TEC (His-tagged) k...
Ligand InfoPC cidPC sid
In DepthDetails US Patent
TargetTyrosine-protein kinase BTK(Homo sapiens (Human))
Boehringer Ingelheim International
US Patent
LigandPNGBDBM394265(US9975882, Example 56)
Affinity DataIC50:  2.20nM. Assay description: Lanthscreen Eu Kinase Binding assay for BMX is performed as described above for BTK except that 1 nM human recombinant full length TEC (His-tagged) k...
Ligand InfoPC cidPC sid
In DepthDetails US Patent
TargetTyrosine-protein kinase TXK(Homo sapiens (Human))
Boehringer Ingelheim International
US Patent
LigandPNGBDBM394265(US9975882, Example 56)
Affinity DataIC50:  150nM. Assay description: Lanthscreen Eu Kinase Binding assay for BMX is performed as described above for BTK except that 1 nM human recombinant full length TEC (His-tagged) k...
Ligand InfoPC cidPC sid
In DepthDetails US Patent
TargetTyrosine-protein kinase Tec(Homo sapiens (Human))
Boehringer Ingelheim International
US Patent
LigandPNGBDBM394265(US9975882, Example 56)
Affinity DataIC50:  120nM. Assay description: Lanthscreen Eu Kinase Binding assay for BMX is performed as described above for BTK except that 1 nM human recombinant full length TEC (His-tagged) k...
Ligand InfoPC cidPC sid
In DepthDetails US Patent
TargetCytoplasmic tyrosine-protein kinase BMX(Homo sapiens (Human))
Boehringer Ingelheim International
US Patent
LigandPNGBDBM394265(US9975882, Example 56)
Affinity DataIC50:  54nM. Assay description: Lanthscreen Eu Kinase Binding assay for BMX is performed as described above for BTK except that 1 nM human recombinant full length TEC (His-tagged) k...
Ligand InfoPC cidPC sid
In DepthDetails US Patent