BDBM394275 US9975902, Example 5
SMILES Nc1ccc(cc1)C1(CC1)NC(=O)CN1C(=O)[C@H]2[C@H]3CC[C@H](C3)[C@H]2C1=O
InChI Key InChIKey=BZOCEQKSTPVBQX-OGRXGRENSA-N
Data  1 IC50
  Tab Delimited (TSV)   2D SDfile   Computed 3D by Vconf -m prep SDfile
Find this compound or compounds like it in BindingDB:
Activity Spreadsheet -- Enzyme Inhibition Constant Data from BindingDB
Found 1 hit for monomerid = 394275
TargetPeptidyl-prolyl cis-trans isomerase D(Homo sapiens (Human))
Merck Patent
US Patent
LigandPNGBDBM394275(US9975902, Example 5)
Affinity DataIC50:  1.05E+5nM. Assay description: The binding capacity of the compounds was measured using a competition Fluorescence-Polarisation based assay with fluorescine labelled cyclosporin.
Ligand InfoPC cidPC sid
In DepthDetails US Patent