BDBM394280 US9975902, Example 10
SMILES [O-][N+](=O)c1ccc(CCNC(=O)CN2C(=O)C3[C@@H]4CCC(C4)[C@@H]3C2=O)cc1
InChI Key InChIKey=JBTDOHQRIGYZNX-MIOCFURKSA-N
Data  1 IC50
  Tab Delimited (TSV)   2D SDfile   Computed 3D by Vconf -m prep SDfile
Find this compound or compounds like it in BindingDB:
Activity Spreadsheet -- Enzyme Inhibition Constant Data from BindingDB
Found 1 hit for monomerid = 394280
TargetPeptidyl-prolyl cis-trans isomerase D(Homo sapiens (Human))
Merck Patent
US Patent
LigandPNGBDBM394280(US9975902, Example 10)
Affinity DataIC50:  1.05E+5nM. Assay description: The binding capacity of the compounds was measured using a competition Fluorescence-Polarisation based assay with fluorescine labelled cyclosporin.
Ligand InfoPC cidPC sid
In DepthDetails US Patent