BDBM394391 1-{5-(2-Fluorophenyl)-1-[(2-fluorophenyl)sulfonyl]-1H-pyrrol-3-yl}-N-methylmethanamine::US10308605, Example 165
SMILES CNCc1cc(-c2ccccc2F)n(c1)S(=O)(=O)c1ccccc1F
InChI Key InChIKey=YPGZNVJLSZKSGN-UHFFFAOYSA-N
Data  1 IC50
  Tab Delimited (TSV)   2D SDfile   Computed 3D by Vconf -m prep SDfile
Find this compound or compounds like it in BindingDB:
Activity Spreadsheet -- Enzyme Inhibition Constant Data from BindingDB
Found 1 hit for monomerid = 394391
TargetPotassium-transporting ATPase alpha chain 1(Sus scrofa (Pig))
Takeda Pharmaceutical
US Patent
LigandPNGBDBM394391(1-{5-(2-Fluorophenyl)-1-[(2-fluorophenyl)sulfonyl]...)
Affinity DataIC50:  9nM. Assay description: According to the method [Biochem. Biophys. Acta., 728, 31 (1983)] of Wallmark et al., a gastric mucous membrane microsomal fraction was prepared from...
Ligand InfoPC cidPC sid
In DepthDetails US Patent