BDBM39440 5-bromanyl-N-(3-cyano-5,5-dimethyl-4,7-dihydrothieno[2,3-c]pyran-2-yl)furan-2-carboxamide::5-bromo-N-(3-cyano-5,5-dimethyl-4,7-dihydrothieno[2,3-c]pyran-2-yl)-2-furamide::5-bromo-N-(3-cyano-5,5-dimethyl-4,7-dihydrothieno[2,3-c]pyran-2-yl)-2-furancarboxamide::5-bromo-N-(3-cyano-5,5-dimethyl-4,7-dihydrothieno[2,3-c]pyran-2-yl)furan-2-carboxamide::MLS000071502::SMR000039866::cid_658862
SMILES CC1(C)Cc2c(CO1)sc(NC(=O)c1ccc(Br)o1)c2C#N
InChI Key InChIKey=FTRZPOPUBMWRNY-UHFFFAOYSA-N
Data  2 EC50
  Tab Delimited (TSV)   2D SDfile   Computed 3D by Vconf -m prep SDfile
Find this compound or compounds like it in BindingDB:
Activity Spreadsheet -- Enzyme Inhibition Constant Data from BindingDB
Found 2 hits for monomerid = 39440
TargetIsoform 2 of Nuclear receptor ROR-alpha (Alpha-2)(Homo sapiens (Human))
The Scripps Research Institute Molecular Screening Center
Curated by PubChem BioAssay
LigandPNGBDBM39440(5-bromanyl-N-(3-cyano-5,5-dimethyl-4,7-dihydrothie...)
Affinity DataEC50:  752nM. Assay description: Source (MLSCN Center Name): The Scripps Research Institute Molecular Screening Center Center Affiliation: The Scripps Research Institute, TSRI Assay ...
In DepthDetails PCBioAssay
TargetSteroidogenic factor 1(Homo sapiens (Human))
The Scripps Research Institute Molecular Screening Center
Curated by PubChem BioAssay
LigandPNGBDBM39440(5-bromanyl-N-(3-cyano-5,5-dimethyl-4,7-dihydrothie...)
Affinity DataEC50: >407nM. Assay description: Source (MLSCN Center Name): The Scripps Research Institute Molecular Screening Center Center Affiliation: The Scripps Research Institute, TSRI Assay ...
In DepthDetails PCBioAssay