BDBM394469 2-(6-amino-5-(8-(pyridin-::US10308614, Example 70
SMILES Nc1nnc(cc1N1CC2CCC(C1)N2c1cccnc1)-c1ccccc1O
InChI Key InChIKey=LONXFOAWXBIHFI-UHFFFAOYSA-N
Data  1 IC50
  Tab Delimited (TSV)   2D SDfile   Computed 3D by Vconf -m prep SDfile
Find this compound or compounds like it in BindingDB:
Activity Spreadsheet -- Enzyme Inhibition Constant Data from BindingDB
Found 1 hit for monomerid = 394469
TargetTranscription activator BRG1 [1448-1575](Homo sapiens (Human))
Genentech
US Patent
LigandPNGBDBM394469(2-(6-amino-5-(8-(pyridin- | US10308614, Example 70)
Affinity DataIC50:  4.10nM. Assay description: His-BRG1 (A1448-S1575; Swiss Prot P51532; mhhhhhhgslvpr\gsAEKLSPNPP NLTKKMKKIVDAVIKYKDSSSGRQLSEVFIQLPSRKELPEYYELIRKPVDFKKIKERIRNH KYRSLNDLEKDVMLLCQNA...
Ligand InfoPC cidPC sid
In DepthDetails US Patent