BDBM394473 2-(6-amino-5-((1R,4R)-5-::US10308614, Example 74
SMILES Nc1nnc(cc1N1C[C@H]2C[C@@H]1CN2c1ccccn1)-c1ccccc1O
InChI Key InChIKey=MTXWDADYKYPVEZ-ZIAGYGMSSA-N
Data  1 IC50
  Tab Delimited (TSV)   2D SDfile   Computed 3D by Vconf -m prep SDfile
Find this compound or compounds like it in BindingDB:
Activity Spreadsheet -- Enzyme Inhibition Constant Data from BindingDB
Found 1 hit for monomerid = 394473
TargetTranscription activator BRG1 [1448-1575](Homo sapiens (Human))
Genentech
US Patent
LigandPNGBDBM394473(2-(6-amino-5-((1R,4R)-5- | US10308614, Example 74)
Affinity DataIC50:  10.6nM. Assay description: His-BRG1 (A1448-S1575; Swiss Prot P51532; mhhhhhhgslvpr\gsAEKLSPNPP NLTKKMKKIVDAVIKYKDSSSGRQLSEVFIQLPSRKELPEYYELIRKPVDFKKIKERIRNH KYRSLNDLEKDVMLLCQNA...
Ligand InfoPC cidPC sid
In DepthDetails US Patent