BDBM394797 US10307413, Compound 445
SMILES C[C@H](N1CC(C1)Nc1cc(ncn1)C(=O)NC[C@H](O)CN1CCc2ccccc2C1)C(F)(F)F
InChI Key InChIKey=ZFNMNWXBLZCLAM-KXBFYZLASA-N
Data  1 IC50
  Tab Delimited (TSV)   2D SDfile   Computed 3D by Vconf -m prep SDfile
Find this compound or compounds like it in BindingDB:
Activity Spreadsheet -- Enzyme Inhibition Constant Data from BindingDB
Found 1 hit for monomerid = 394797
TargetProtein arginine N-methyltransferase 5(Homo sapiens (Human))
Epizyme
US Patent
LigandPNGBDBM394797(US10307413, Compound 445)
Affinity DataIC50: <100nM. Assay description: The assays were all performed in a buffer consisting of 20 mM Bicine (pH=7.6), 1 mM TCEP, 0.005% BSG, and 0.002% Tween20, prepared on the day of use....
Ligand InfoPC cidPC sid
In DepthDetails US Patent