BDBM395170 US10308620, Example 16
SMILES COc1ccc(CN2C=C(Oc3ccccc23)C(=O)NCC(C)(C)O)cn1
InChI Key InChIKey=QNLZIRMSYNQPRV-UHFFFAOYSA-N
Data  1 EC50
  Tab Delimited (TSV)   2D SDfile   Computed 3D by Vconf -m prep SDfile
Find this compound or compounds like it in BindingDB:
Activity Spreadsheet -- Enzyme Inhibition Constant Data from BindingDB
Found 1 hit for monomerid = 395170
TargetMuscarinic acetylcholine receptor M1(Homo sapiens (Human))
Suven Life Sciences
US Patent
LigandPNGBDBM395170(US10308620, Example 16)
Affinity DataEC50:  1.35E+3nM. Assay description: A stable CHO cell line expressing recombinant human Muscarinic M1 receptor and pCRE-Luc reporter system was used for cell-based assay. The assay offe...
Ligand InfoPC cidPC sid
In DepthDetails US Patent