BDBM395184 US10308620, Example 30
SMILES O[C@H]1CCCC[C@@H]1NC(=O)C1=CN(Cc2ccccc2)c2ncccc2O1
InChI Key InChIKey=UBEOSJPIWUBCQO-IRXDYDNUSA-N
Data  1 EC50
  Tab Delimited (TSV)   2D SDfile   Computed 3D by Vconf -m prep SDfile
Find this compound or compounds like it in BindingDB:
Activity Spreadsheet -- Enzyme Inhibition Constant Data from BindingDB
Found 1 hit for monomerid = 395184
TargetMuscarinic acetylcholine receptor M1(Homo sapiens (Human))
Suven Life Sciences
US Patent
LigandPNGBDBM395184(US10308620, Example 30)
Affinity DataEC50:  955nM. Assay description: A stable CHO cell line expressing recombinant human Muscarinic M1 receptor and pCRE-Luc reporter system was used for cell-based assay. The assay offe...
Ligand InfoPC cidPC sid
In DepthDetails US Patent