BDBM39519 MLS000073639::N-(6-Methoxy-benzothiazol-2-yl)-2-[4-methyl-5-(2-methyl-furan-3-yl)-4H-[1,2,4]triazol-3-ylsulfanyl]-acetamide::N-(6-methoxy-1,3-benzothiazol-2-yl)-2-[[4-methyl-5-(2-methyl-3-furanyl)-1,2,4-triazol-3-yl]thio]acetamide::N-(6-methoxy-1,3-benzothiazol-2-yl)-2-[[4-methyl-5-(2-methyl-3-furyl)-1,2,4-triazol-3-yl]thio]acetamide::N-(6-methoxy-1,3-benzothiazol-2-yl)-2-[[4-methyl-5-(2-methylfuran-3-yl)-1,2,4-triazol-3-yl]sulfanyl]acetamide::N-(6-methoxy-1,3-benzothiazol-2-yl)-2-[[4-methyl-5-(2-methylfuran-3-yl)-1,2,4-triazol-3-yl]sulfanyl]ethanamide::SMR000005712::cid_646449
SMILES COc1ccc2nc(NC(=O)CSc3nnc(-c4ccoc4C)n3C)sc2c1
InChI Key InChIKey=NMFKWQPECCXKNL-UHFFFAOYSA-N
Data  2 EC50
  Tab Delimited (TSV)   2D SDfile   Computed 3D by Vconf -m prep SDfile
Find this compound or compounds like it in BindingDB:
Activity Spreadsheet -- Enzyme Inhibition Constant Data from BindingDB
Found 2 hits for monomerid = 39519
TargetIsoform 2 of Nuclear receptor ROR-alpha (Alpha-2)(Homo sapiens (Human))
The Scripps Research Institute Molecular Screening Center
Curated by PubChem BioAssay
LigandPNGBDBM39519(MLS000073639 | N-(6-Methoxy-benzothiazol-2-yl)-2-[...)
Affinity DataEC50:  2.03E+3nM. Assay description: Source (MLSCN Center Name): The Scripps Research Institute Molecular Screening Center Center Affiliation: The Scripps Research Institute, TSRI Assay ...
In DepthDetails PCBioAssay
TargetSteroidogenic factor 1(Homo sapiens (Human))
The Scripps Research Institute Molecular Screening Center
Curated by PubChem BioAssay
LigandPNGBDBM39519(MLS000073639 | N-(6-Methoxy-benzothiazol-2-yl)-2-[...)
Affinity DataEC50:  4.84E+3nM. Assay description: Source (MLSCN Center Name): The Scripps Research Institute Molecular Screening Center Center Affiliation: The Scripps Research Institute, TSRI Assay ...
In DepthDetails PCBioAssay