BDBM395212 N-(3-Fluoropiperidin-4-yl)-4-(2-fluorobenzyl)-8-fluoro-4H-benzo[1,4]oxazine-2-carboxamide hydrochloride::US10308620, Example 73
SMILES FC1CNCCC1NC(=O)C1=CN(Cc2ccccc2F)c2cccc(F)c2O1
InChI Key InChIKey=XFWRTNLJWQWTIS-UHFFFAOYSA-N
Data  1 EC50
  Tab Delimited (TSV)   2D SDfile   Computed 3D by Vconf -m prep SDfile
Find this compound or compounds like it in BindingDB:
Activity Spreadsheet -- Enzyme Inhibition Constant Data from BindingDB
Found 1 hit for monomerid = 395212
TargetMuscarinic acetylcholine receptor M1(Homo sapiens (Human))
Suven Life Sciences
US Patent
LigandPNGBDBM395212(N-(3-Fluoropiperidin-4-yl)-4-(2-fluorobenzyl)-8-fl...)
Affinity DataEC50:  2.37E+3nM. Assay description: A stable CHO cell line expressing recombinant human Muscarinic M1 receptor and pCRE-Luc reporter system was used for cell-based assay. The assay offe...
Ligand InfoPC cidPC sid
In DepthDetails US Patent