BDBM395271 4-Fluoro-3-methoxy-N-4-[rel-(4aS,5aR)-5a-methyl-4,6-dioxo-3-(phenylamino)-1,4,4a,5,5a,6-hexahydrocyclopropa[f]indol-2-yl]pyridin-2-ylbenzamide::US10308629, Example 35
SMILES COc1cc(ccc1F)C(=O)Nc1cc(ccn1)-c1[nH]c2c(c1Nc1ccccc1)C(=O)[C@H]1C[C@@]1(C)C2=O
InChI Key
Data  1 IC50
  Tab Delimited (TSV)   2D SDfile   Computed 3D by Vconf -m prep SDfile
Find this compound or compounds like it in BindingDB:
Activity Spreadsheet -- Enzyme Inhibition Constant Data from BindingDB
Found 1 hit for monomerid = 395271
TargetMitotic checkpoint serine/threonine-protein kinase BUB1(Homo sapiens (Human))
Bayer Pharma Aktiengesellschaft
US Patent
LigandPNGBDBM395271(4-Fluoro-3-methoxy-N-4-[rel-(4aS,5aR)-5a-methyl-4,...)
Affinity DataIC50:  71nM. Assay description: Bub1-inhibitory activities of compounds described in the present invention were quantified using a time-resolved fluorescence energy transfer (TR-FRE...
Ligand InfoPC cidPC sid
In DepthDetails US Patent