BDBM395294 N-[6-(Hydroxymethyl)-2-(oxetan-3-ylmethyl)-2H-indazol-5-yl]-6-(trifluoromethyl)pyridine-2-carboxamide::US10308634, Example 9::US10793545, Example 9
SMILES OCc1cc2nn(CC3COC3)cc2cc1NC(=O)c1cccc(n1)C(F)(F)F
InChI Key InChIKey=AUJQEAQOZZRWLQ-UHFFFAOYSA-N
Data  2 IC50
  Tab Delimited (TSV)   2D SDfile   Computed 3D by Vconf -m prep SDfile
Find this compound or compounds like it in BindingDB:
Activity Spreadsheet -- Enzyme Inhibition Constant Data from BindingDB
Found 2 hits for monomerid = 395294
TargetInterleukin-1 receptor-associated kinase 4(Homo sapiens (Human))
Bayer Pharma Aktiengesellschaft
US Patent
LigandPNGBDBM395294(N-[6-(Hydroxymethyl)-2-(oxetan-3-ylmethyl)-2H-inda...)
Affinity DataIC50:  104nM. Assay description: For the assay, 11 different concentrations in the range from 20 μM to 0.073 nM were prepared from a 2 mM DMSO solution of the test substance. 50...
Ligand InfoPC cidPC sid
In DepthDetails US Patent
TargetInterleukin-1 receptor-associated kinase 4(Homo sapiens (Human))
Bayer Pharma Aktiengesellschaft
US Patent
LigandPNGBDBM395294(N-[6-(Hydroxymethyl)-2-(oxetan-3-ylmethyl)-2H-inda...)
Affinity DataIC50:  104nM. Assay description: For the assay, 11 different concentrations in the range from 20 μM to 0.073 nM were prepared from a 2 mM DMSO solution of the test substance. 50...
Ligand InfoPC cidPC sid
In DepthDetails US Patent