BDBM395340 US10308636, Example 24-2
SMILES CC(C)(C)OCCc1c[nH]c(n1)-c1ccc(nc1)-c1ccc(OCC(C)(C)C(O)=O)cc1
InChI Key InChIKey=FVQKIWYIJAVVFW-UHFFFAOYSA-N
Data  1 IC50
  Tab Delimited (TSV)   2D SDfile   Computed 3D by Vconf -m prep SDfile
Find this compound or compounds like it in BindingDB:
Activity Spreadsheet -- Enzyme Inhibition Constant Data from BindingDB
Found 1 hit for monomerid = 395340
TargetDiacylglycerol O-acyltransferase 1(Homo sapiens (Human))
Mitsubishi Tanabe Pharma
US Patent
LigandPNGBDBM395340(US10308636, Example 24-2)
Affinity DataIC50:  26nM. Assay description: As a buffer used for the enzymatic reaction of DGAT1, 100 mM Tris-HCl (pH7.4), 200 mM Sucrose, and 20 mM MgCl2, 0.125% Bovin Serum Albumin (BSA) were...
Ligand InfoPC cidPC sid
In DepthDetails US Patent