BDBM395383 US10308636, Example 78
SMILES NC(=O)c1ccc(Br)cc1F
InChI Key InChIKey=MJDRFCPNHLHNON-UHFFFAOYSA-N
Data  1 IC50
  Tab Delimited (TSV)   2D SDfile   Computed 3D by Vconf -m prep SDfile
Find this compound or compounds like it in BindingDB:
Activity Spreadsheet -- Enzyme Inhibition Constant Data from BindingDB
Found 1 hit for monomerid = 395383
TargetDiacylglycerol O-acyltransferase 1(Homo sapiens (Human))
Mitsubishi Tanabe Pharma
US Patent
LigandPNGBDBM395383(US10308636, Example 78)
Affinity DataIC50:  1.70nM. Assay description: As a buffer used for the enzymatic reaction of DGAT1, 100 mM Tris-HCl (pH7.4), 200 mM Sucrose, and 20 mM MgCl2, 0.125% Bovin Serum Albumin (BSA) were...
In DepthDetails US Patent