BDBM39545 3-(3-methoxyphenyl)-5-(3-pyridinyl)-1,2,4-oxadiazole::3-(3-methoxyphenyl)-5-(3-pyridyl)-1,2,4-oxadiazole::3-(3-methoxyphenyl)-5-pyridin-3-yl-1,2,4-oxadiazole::MLS000083720::SMR000047695::cid_666412
SMILES COc1cccc(c1)-c1noc(n1)-c1cccnc1
InChI Key InChIKey=DDVVNKRYLQKSGG-UHFFFAOYSA-N
Data  3 EC50
  Tab Delimited (TSV)   2D SDfile   Computed 3D by Vconf -m prep SDfile
Find this compound or compounds like it in BindingDB:
Activity Spreadsheet -- Enzyme Inhibition Constant Data from BindingDB
Found 3 hits for monomerid = 39545
TargetSteroidogenic factor 1(Homo sapiens (Human))
The Scripps Research Institute Molecular Screening Center
Curated by PubChem BioAssay
LigandPNGBDBM39545(3-(3-methoxyphenyl)-5-(3-pyridinyl)-1,2,4-oxadiazo...)
Affinity DataEC50:  1.74E+3nM. Assay description: Source (MLSCN Center Name): The Scripps Research Institute Molecular Screening Center Center Affiliation: The Scripps Research Institute, TSRI Assay ...
In DepthDetails PCBioAssay
TargetTranscription factor p65(Homo sapiens (Human))
Srmlsc
Curated by PubChem BioAssay
LigandPNGBDBM39545(3-(3-methoxyphenyl)-5-(3-pyridinyl)-1,2,4-oxadiazo...)
Affinity DataEC50:  2.97E+5nM. Assay description: Southern Research Molecular Libraries Screening Center (SRMLSC) Southern Research Institute (Birmingham, Alabama) NIH Molecular Libraries Screening C...
In DepthDetails PCBioAssay
TargetIsoform 2 of Nuclear receptor ROR-alpha (Alpha-2)(Homo sapiens (Human))
The Scripps Research Institute Molecular Screening Center
Curated by PubChem BioAssay
LigandPNGBDBM39545(3-(3-methoxyphenyl)-5-(3-pyridinyl)-1,2,4-oxadiazo...)
Affinity DataEC50:  853nM. Assay description: Source (MLSCN Center Name): The Scripps Research Institute Molecular Screening Center Center Affiliation: The Scripps Research Institute, TSRI Assay ...
In DepthDetails PCBioAssay