BDBM395595 (R)-1-((7-cyano-2- (3'-(7-((3-hydroxy- pyrrolidin-1-yl)- methyl)pyrido [3,2- d]pyrimidin-4- ylamino)-2,2'- dimethylbiphenyl- 3-yl)benzo[d]oxazol- 5-yl)methyl)piperidine-::US10308644, Example 207::US10800768, Example 207::US11339149, Example 207
SMILES Cc1c(Nc2ncnc3cc(CN4CC[C@@H](O)C4)cnc23)cccc1-c1cccc(-c2nc3cc(CN4CCC(CC4)C(O)=O)cc(C#N)c3o2)c1C
InChI Key InChIKey=PRMBMMRBXKKNHZ-SSEXGKCCSA-N
Data  3 IC50
  Tab Delimited (TSV)   2D SDfile   Computed 3D by Vconf -m prep SDfile
Find this compound or compounds like it in BindingDB:
Activity Spreadsheet -- Enzyme Inhibition Constant Data from BindingDB
Found 3 hits for monomerid = 395595
TargetProgrammed cell death 1 ligand 1 [19-238]/protein 1 [25-167](Homo sapiens (Human))
Incyte
US Patent
LigandPNGBDBM395595((R)-1-((7-cyano-2- (3'-(7-((3-hydroxy- pyrrolidin-...)
Affinity DataIC50: <10nM. Assay description: TBD
Ligand InfoPC cidPC sid
In DepthDetails US Patent
TargetProgrammed cell death 1 ligand 1 [19-238]/protein 1 [25-167](Homo sapiens (Human))
Incyte
US Patent
LigandPNGBDBM395595((R)-1-((7-cyano-2- (3'-(7-((3-hydroxy- pyrrolidin-...)
Affinity DataIC50: <10nM. Assay description: The assays were conducted in a standard black 384-well polystyrene plate with a final volume of 20 μL. Inhibitors were first serially diluted in...
Ligand InfoPC cidPC sid
In DepthDetails US Patent
TargetProgrammed cell death 1 ligand 1 [19-238]/protein 1 [25-167](Homo sapiens (Human))
Incyte
US Patent
LigandPNGBDBM395595((R)-1-((7-cyano-2- (3'-(7-((3-hydroxy- pyrrolidin-...)
Affinity DataIC50:  3.00E+3nM. Assay description: TBD
Ligand InfoPC cidPC sid
In DepthDetails US Patent