BDBM39569 MLS000110197::N-(2,3-dihydro-1,4-benzodioxin-6-yl)-3-(4-methoxyphenyl)propanamide::N-(2,3-dihydro-1,4-benzodioxin-6-yl)-3-(4-methoxyphenyl)propionamide::SMR000106128::cid_874557
SMILES COc1ccc(CCC(=O)Nc2ccc3OCCOc3c2)cc1
InChI Key InChIKey=BSNHRXPMBVZEKE-UHFFFAOYSA-N
Data  2 EC50
  Tab Delimited (TSV)   2D SDfile   Computed 3D by Vconf -m prep SDfile
Find this compound or compounds like it in BindingDB:
Activity Spreadsheet -- Enzyme Inhibition Constant Data from BindingDB
Found 2 hits for monomerid = 39569
TargetIsoform 2 of Nuclear receptor ROR-alpha (Alpha-2)(Homo sapiens (Human))
The Scripps Research Institute Molecular Screening Center
Curated by PubChem BioAssay
LigandPNGBDBM39569(MLS000110197 | N-(2,3-dihydro-1,4-benzodioxin-6-yl...)
Affinity DataEC50: >9.90E+4nM. Assay description: Source (MLSCN Center Name): The Scripps Research Institute Molecular Screening Center Center Affiliation: The Scripps Research Institute, TSRI Assay ...
In DepthDetails PCBioAssay
TargetSteroidogenic factor 1(Homo sapiens (Human))
The Scripps Research Institute Molecular Screening Center
Curated by PubChem BioAssay
LigandPNGBDBM39569(MLS000110197 | N-(2,3-dihydro-1,4-benzodioxin-6-yl...)
Affinity DataEC50: >9.90E+4nM. Assay description: Source (MLSCN Center Name): The Scripps Research Institute Molecular Screening Center Center Affiliation: The Scripps Research Institute, TSRI Assay ...
In DepthDetails PCBioAssay