BDBM395737 US10308652, Example 18
SMILES OC1CNC(c2c1nc1ccc(nn21)-c1ccc(cc1)C(=O)N1CC(C1)C(O)=O)c1ccccc1OC(F)F
InChI Key InChIKey=SFKVCXQCOASQDJ-UHFFFAOYSA-N
Data  1 IC50
  Tab Delimited (TSV)   2D SDfile   Computed 3D by Vconf -m prep SDfile
Find this compound or compounds like it in BindingDB:
Activity Spreadsheet -- Enzyme Inhibition Constant Data from BindingDB
Found 1 hit for monomerid = 395737
TargetTumor necrosis factor(Homo sapiens (Human))
Bristol-Myers Squibb
US Patent
LigandPNGBDBM395737(US10308652, Example 18)
Affinity DataIC50:  1.75E+4nM. Assay description: Test compounds serially diluted in DMSO were plated in an assay plate (Labcyte, Cat. #LP-0200) at final concentrations ranging from 0.004 μM to ...
Ligand InfoPC cidPC sid
In DepthDetails US Patent