BDBM395741 US10308652, Example 22
SMILES OC1CNC(c2c1nc1ccc(nn21)-c1cnc(nc1)N1CCN(CC(O)=O)CC1)c1ccccc1OC(F)F
InChI Key InChIKey=XKSJSZGVALZYQB-UHFFFAOYSA-N
Data  1 IC50
  Tab Delimited (TSV)   2D SDfile   Computed 3D by Vconf -m prep SDfile
Find this compound or compounds like it in BindingDB:
Activity Spreadsheet -- Enzyme Inhibition Constant Data from BindingDB
Found 1 hit for monomerid = 395741
TargetTumor necrosis factor(Homo sapiens (Human))
Bristol-Myers Squibb
US Patent
LigandPNGBDBM395741(US10308652, Example 22)
Affinity DataIC50:  5.50E+3nM. Assay description: Test compounds serially diluted in DMSO were plated in an assay plate (Labcyte, Cat. #LP-0200) at final concentrations ranging from 0.004 μM to ...
Ligand InfoPC cidPC sid
In DepthDetails US Patent