BDBM395760 US10308652, Example 41
SMILES CS(=O)(=O)c1ccc(cc1)-c1ccc2nc3[C@@H](O)CN[C@@H](c3n2n1)c1ccccc1OC(F)F
InChI Key InChIKey=VRBXAJMGUYKMGP-FXAWDEMLSA-N
Data  1 IC50
  Tab Delimited (TSV)   2D SDfile   Computed 3D by Vconf -m prep SDfile
Find this compound or compounds like it in BindingDB:
Activity Spreadsheet -- Enzyme Inhibition Constant Data from BindingDB
Found 1 hit for monomerid = 395760
TargetTumor necrosis factor(Homo sapiens (Human))
Bristol-Myers Squibb
US Patent
LigandPNGBDBM395760(US10308652, Example 41)
Affinity DataIC50:  5.50E+3nM. Assay description: Test compounds serially diluted in DMSO were plated in an assay plate (Labcyte, Cat. #LP-0200) at final concentrations ranging from 0.004 μM to ...
Ligand InfoPC cidPC sid
In DepthDetails US Patent