BDBM39581 6-Amino-4-(4-hydroxy-3-methoxy-phenyl)-3-propyl-1,4-dihydro-pyrano[2,3-c]pyrazole-5-carbonitrile::6-amino-4-(4-hydroxy-3-methoxy-phenyl)-3-propyl-2,4-dihydropyrano[2,3-c]pyrazole-5-carbonitrile::6-amino-4-(4-hydroxy-3-methoxyphenyl)-3-propyl-2,4-dihydropyrano[2,3-c]pyrazole-5-carbonitrile::6-azanyl-4-(3-methoxy-4-oxidanyl-phenyl)-3-propyl-2,4-dihydropyrano[2,3-c]pyrazole-5-carbonitrile::MLS000071647::SMR000011183::cid_652676
SMILES CCCc1[nH]nc2OC(=N)C(C#N)C(c12)c1ccc(O)c(OC)c1
InChI Key InChIKey=AFNGNPHFIUPCFH-UHFFFAOYSA-N
Data  1 IC50  3 EC50
  Tab Delimited (TSV)   2D SDfile   Computed 3D by Vconf -m prep SDfile
Find this compound or compounds like it in BindingDB:
Activity Spreadsheet -- Enzyme Inhibition Constant Data from BindingDB
Found 4 hits for monomerid = 39581
TargetAlkaline phosphatase, germ cell type(Homo sapiens (Human))
Burnham Center For Chemical Genomics
Curated by PubChem BioAssay
LigandPNGBDBM39581(6-Amino-4-(4-hydroxy-3-methoxy-phenyl)-3-propyl-1,...)
Affinity DataIC50:  1.18E+4nM. Assay description: Sanford-Burnham Center for Chemical Genomics (SBCCG) Sanford-Burnham Medical Research Institute (SBMRI, San Diego, CA) NIH Molecular Libraries Screen...
In DepthDetails PCBioAssay
TargetProtein RecA(Mycobacterium tuberculosis H37Rv)
Broad Institute
Curated by PubChem BioAssay
LigandPNGBDBM39581(6-Amino-4-(4-hydroxy-3-methoxy-phenyl)-3-propyl-1,...)
Affinity DataEC50:  8.18E+3nM. Assay description: Keywords: GFP-RecA intein, protein splicing, refolding, reducing reagent, GFP fluorescence Assay Overview: M. tuberculosis harbors three inteins, whi...
In DepthDetails PCBioAssay
TargetProtein RecA(Mycobacterium tuberculosis H37Rv)
Broad Institute
Curated by PubChem BioAssay
LigandPNGBDBM39581(6-Amino-4-(4-hydroxy-3-methoxy-phenyl)-3-propyl-1,...)
Affinity DataEC50:  8.22E+4nM. Assay description: Keywords: GFP, refolding, reducing reagent, GFP fluorescence Assay Overview: M. tuberculosis harbors three inteins, which interrupt the DnaB, RecA, a...
In DepthDetails PCBioAssay
TargetAlkaline phosphatase, germ cell type(Homo sapiens (Human))
Burnham Center For Chemical Genomics
Curated by PubChem BioAssay
LigandPNGBDBM39581(6-Amino-4-(4-hydroxy-3-methoxy-phenyl)-3-propyl-1,...)
Affinity DataEC50:  9.99E+5nM. Assay description: Sanford-Burnham Center for Chemical Genomics (SBCCG) Sanford-Burnham Medical Research Institute (SBMRI, San Diego, CA) NIH Molecular Libraries Screen...
In DepthDetails PCBioAssay