BDBM395814 3-[5-cyclopropyl-4-(cyclopropylmethoxy)pyridin-2-yl]-5-ethyl-1,2,4-oxadiazole::US10308659, Example 13
SMILES CCc1nc(no1)-c1cc(OCC2CC2)c(cn1)C1CC1
InChI Key InChIKey=GKEGYWKEZZYQMZ-UHFFFAOYSA-N
Data  2 EC50
  Tab Delimited (TSV)   2D SDfile   Computed 3D by Vconf -m prep SDfile
Find this compound or compounds like it in BindingDB:
Activity Spreadsheet -- Enzyme Inhibition Constant Data from BindingDB
Found 2 hits for monomerid = 395814
TargetCannabinoid receptor 1(Homo sapiens (Human))
Hoffmann-La Roche
US Patent
LigandPNGBDBM395814(3-[5-cyclopropyl-4-(cyclopropylmethoxy)pyridin-2-y...)
Affinity DataEC50: >1.00E+4nM. Assay description: The affinity of the compounds of the invention for cannabinoid CB1 receptors was determined using recommended amounts of membrane preparations (Perki...
Ligand InfoPC cidPC sid
In DepthDetails US Patent
TargetCannabinoid receptor 2(Homo sapiens (Human))
Hoffmann-La Roche
US Patent
LigandPNGBDBM395814(3-[5-cyclopropyl-4-(cyclopropylmethoxy)pyridin-2-y...)
Affinity DataEC50:  31.9nM. Assay description: The affinity of the compounds of the invention for cannabinoid CB1 receptors was determined using recommended amounts of membrane preparations (Perki...
Ligand InfoPC cidPC sid
In DepthDetails US Patent