BDBM395831 2-[5-(3,3-difluoroazetidin-1-yl)-4-(2,2,2-trifluoroethoxy)pyridin-2-yl]-4,4-diethyl-5H-1,3-oxazole::US10308659, Example 30
SMILES CCC1(CC)COC(=N1)c1cc(OCC(F)(F)F)c(cn1)N1CC(F)(F)C1
InChI Key InChIKey=SMXTZXKFGFEANC-UHFFFAOYSA-N
Data  2 EC50
  Tab Delimited (TSV)   2D SDfile   Computed 3D by Vconf -m prep SDfile
Find this compound or compounds like it in BindingDB:
Activity Spreadsheet -- Enzyme Inhibition Constant Data from BindingDB
Found 2 hits for monomerid = 395831
TargetCannabinoid receptor 1(Homo sapiens (Human))
Hoffmann-La Roche
US Patent
LigandPNGBDBM395831(2-[5-(3,3-difluoroazetidin-1-yl)-4-(2,2,2-trifluor...)
Affinity DataEC50: >1.00E+4nM. Assay description: The affinity of the compounds of the invention for cannabinoid CB1 receptors was determined using recommended amounts of membrane preparations (Perki...
Ligand InfoPC cidPC sid
In DepthDetails US Patent
TargetCannabinoid receptor 2(Homo sapiens (Human))
Hoffmann-La Roche
US Patent
LigandPNGBDBM395831(2-[5-(3,3-difluoroazetidin-1-yl)-4-(2,2,2-trifluor...)
Affinity DataEC50:  2.60nM. Assay description: The affinity of the compounds of the invention for cannabinoid CB1 receptors was determined using recommended amounts of membrane preparations (Perki...
Ligand InfoPC cidPC sid
In DepthDetails US Patent