BDBM395995 US10308660, Example 96
SMILES C[C@@H]1OCC2(CCN(CC2)c2ncc(Sc3cccnc3C(F)(F)F)c(=O)[nH]2)[C@@H]1N
InChI Key
Data  7 IC50
  Tab Delimited (TSV)   2D SDfile   Computed 3D by Vconf -m prep SDfile
Find this compound or compounds like it in BindingDB:
Activity Spreadsheet -- Enzyme Inhibition Constant Data from BindingDB
Found 7 hits for monomerid = 395995
TargetTyrosine-protein phosphatase non-receptor type 11(Homo sapiens (Human))
Novartis
US Patent
LigandPNGBDBM395995(US10308660, Example 96)
Affinity DataIC50:  31nM. Assay description: SHP2 is allosterically activated through binding of bis-tyrosyl-phosphorylated peptides to its Src Homology 2 (SH2) domains. The latter activation st...
Ligand InfoPC cidPC sid
In DepthDetails US Patent
LigandPNGBDBM395995(US10308660, Example 96)
Affinity DataIC50:  1.06E+3nM. Assay description: Inhibition of SHP2 in human KYSE520 cells assessed as reduction in ERK phosphorylation after 2 hrs by SureFire p-ERK assay
Ligand InfoPC cidPC sid
In DepthDetails ArticlePubMed
TargetPotassium voltage-gated channel subfamily H member 2(Homo sapiens (Human))
TBA
Curated by ChEMBL
LigandPNGBDBM395995(US10308660, Example 96)
Affinity DataIC50: >3.00E+4nM. Assay description: Inhibition of human ERG
Ligand InfoPC cidPC sid
In DepthDetails ArticlePubMed
LigandPNGBDBM395995(US10308660, Example 96)
Affinity DataIC50:  31nM. Assay description: Inhibition of human 6His-tagged SHP2 (1 to 525 residues) expressed in Escherichia coli BL21 Star (DE3) using DiFMUP as surrogate substrate as preincu...
Ligand InfoPC cidPC sid
In DepthDetails ArticlePubMed
LigandPNGBDBM395995(US10308660, Example 96)
Affinity DataIC50:  31nM. Assay description: Inhibition of human 6His-tagged SHP2 (1 to 525 residues) expressed in Escherichia coli BL21 Star (DE3) using DiFMUP as surrogate substrate as preincu...
Ligand InfoPC cidPC sid
In DepthDetails ArticlePubMed
LigandPNGBDBM395995(US10308660, Example 96)
Affinity DataIC50:  1.06E+3nM. Assay description: Inhibition of SHP2 in human KYSE520 cells assessed as reduction in ERK phosphorylation after 2 hrs by SureFire p-ERK assay
Ligand InfoPC cidPC sid
In DepthDetails ArticlePubMed
TargetPotassium voltage-gated channel subfamily H member 2(Homo sapiens (Human))
TBA
Curated by ChEMBL
LigandPNGBDBM395995(US10308660, Example 96)
Affinity DataIC50: >3.00E+4nM. Assay description: Inhibition of human ERG
Ligand InfoPC cidPC sid
In DepthDetails ArticlePubMed