BDBM396019 US10308660, Example 120
SMILES C[C@@H]1OCC2(CCN(CC2)c2ccc(Sc3cccc(Cl)c3Cl)c(=O)[nH]2)[C@@H]1N
InChI Key
Data  1 IC50
  Tab Delimited (TSV)   2D SDfile   Computed 3D by Vconf -m prep SDfile
Find this compound or compounds like it in BindingDB:
Activity Spreadsheet -- Enzyme Inhibition Constant Data from BindingDB
Found 1 hit for monomerid = 396019
TargetTyrosine-protein phosphatase non-receptor type 11(Homo sapiens (Human))
Novartis
US Patent
LigandPNGBDBM396019(US10308660, Example 120)
Affinity DataIC50:  15nM. Assay description: SHP2 is allosterically activated through binding of bis-tyrosyl-phosphorylated peptides to its Src Homology 2 (SH2) domains. The latter activation st...
Ligand InfoPC cidPC sid
In DepthDetails US Patent