BDBM396020 5-((2-amino-3-chloropyridin-4-yl)thio)-2-((3S,4S)-4-amino-3-methyl-2-oxa-8-azaspiro[4.5]decan-8-yl)-3,6-dimethylpyrimidin-4(3H)-one::US10308660, Example 121
SMILES C[C@@H]1OCC2(CCN(CC2)c2nc(C)c(Sc3ccnc(N)c3Cl)c(=O)n2C)[C@@H]1N
InChI Key InChIKey=QFRRGTFNDYLUIL-BLLLJJGKSA-N
Data  1 IC50
  Tab Delimited (TSV)   2D SDfile   Computed 3D by Vconf -m prep SDfile
Find this compound or compounds like it in BindingDB:
Activity Spreadsheet -- Enzyme Inhibition Constant Data from BindingDB
Found 1 hit for monomerid = 396020
TargetTyrosine-protein phosphatase non-receptor type 11(Homo sapiens (Human))
Novartis
US Patent
LigandPNGBDBM396020(5-((2-amino-3-chloropyridin-4-yl)thio)-2-((3S,4S)-...)
Affinity DataIC50:  60nM. Assay description: SHP2 is allosterically activated through binding of bis-tyrosyl-phosphorylated peptides to its Src Homology 2 (SH2) domains. The latter activation st...
Ligand InfoPC cidPC sid
In DepthDetails US Patent