BDBM396034 US10308660, Example 136
SMILES C[C@@H]1OCC2(CCN(CC2)c2nc(N)c(-c3ccc(Cl)cc3)c(=O)n2C)[C@@H]1N
InChI Key InChIKey=MICHQPFSHWYQPB-BLLLJJGKSA-N
Data  1 IC50
  Tab Delimited (TSV)   2D SDfile   Computed 3D by Vconf -m prep SDfile
Find this compound or compounds like it in BindingDB:
Activity Spreadsheet -- Enzyme Inhibition Constant Data from BindingDB
Found 1 hit for monomerid = 396034
TargetTyrosine-protein phosphatase non-receptor type 11(Homo sapiens (Human))
Novartis
US Patent
LigandPNGBDBM396034(US10308660, Example 136)
Affinity DataIC50:  20nM. Assay description: SHP2 is allosterically activated through binding of bis-tyrosyl-phosphorylated peptides to its Src Homology 2 (SH2) domains. The latter activation st...
Ligand InfoPC cidPC sid
In DepthDetails US Patent