BDBM396043 US10308660, Example 145
SMILES C[C@@H]1OCC2(CCN(CC2)c2nc(N)c(-c3ccc(OC(F)F)cc3)c(=O)n2C)[C@@H]1N
InChI Key InChIKey=YEWAJZRABPOLDP-BLLLJJGKSA-N
Data  1 IC50
  Tab Delimited (TSV)   2D SDfile   Computed 3D by Vconf -m prep SDfile
Find this compound or compounds like it in BindingDB:
Activity Spreadsheet -- Enzyme Inhibition Constant Data from BindingDB
Found 1 hit for monomerid = 396043
TargetTyrosine-protein phosphatase non-receptor type 11(Homo sapiens (Human))
Novartis
US Patent
LigandPNGBDBM396043(US10308660, Example 145)
Affinity DataIC50:  34nM. Assay description: SHP2 is allosterically activated through binding of bis-tyrosyl-phosphorylated peptides to its Src Homology 2 (SH2) domains. The latter activation st...
Ligand InfoPC cidPC sid
In DepthDetails US Patent