BDBM396150 5-Methyl-6-(6-methyl-pyridin-2-yl methyl)-[1,2,5]oxadiazolo[3,4-b]pyridin-7-ylamine::US10308667, Example 53
SMILES Cc1cccc(Cc2c(C)nc3nonc3c2N)n1
InChI Key InChIKey=YYLACQNKQNKLHK-UHFFFAOYSA-N
Data  1 IC50
  Tab Delimited (TSV)   2D SDfile   Computed 3D by Vconf -m prep SDfile
Find this compound or compounds like it in BindingDB:
Activity Spreadsheet -- Enzyme Inhibition Constant Data from BindingDB
Found 1 hit for monomerid = 396150
TargetGhrelin O-acyltransferase(Homo sapiens (Human))
Boehringer Ingelheim International
US Patent
LigandPNGBDBM396150(5-Methyl-6-(6-methyl-pyridin-2-yl methyl)-[1,2,5]o...)
Affinity DataIC50:  2.60nM. Assay description: Cells are plated with a density of 5000 cells/well in 384-well poly-D-lysin plates and incubated for 1 day at 37° C., 5% CO2 in DMEM medium, 10% FCS,...
Ligand InfoPC cidPC sid
In DepthDetails US Patent