BDBM396179 2-(7-amino-5-methyl-[1,2,5]oxadiazolo[3,4-b]pyridin-6-yl methyl)-4-(1,1-difluoroethyl)pyrimidine-5-carbonitrile::US10308667, Example 82
SMILES Cc1nc2nonc2c(N)c1Cc1ncc(C#N)c(n1)C(C)(F)F
InChI Key InChIKey=UVJRZXQBYFJJBF-UHFFFAOYSA-N
Data  1 IC50
  Tab Delimited (TSV)   2D SDfile   Computed 3D by Vconf -m prep SDfile
Find this compound or compounds like it in BindingDB:
Activity Spreadsheet -- Enzyme Inhibition Constant Data from BindingDB
Found 1 hit for monomerid = 396179
TargetGhrelin O-acyltransferase(Homo sapiens (Human))
Boehringer Ingelheim International
US Patent
LigandPNGBDBM396179(2-(7-amino-5-methyl-[1,2,5]oxadiazolo[3,4-b]pyridi...)
Affinity DataIC50:  1nM. Assay description: Cells are plated with a density of 5000 cells/well in 384-well poly-D-lysin plates and incubated for 1 day at 37° C., 5% CO2 in DMEM medium, 10% FCS,...
Ligand InfoPC cidPC sid
In DepthDetails US Patent