BDBM396278 US10314827, Compound 31
SMILES CO[C@@H]1CC[C@]2(C)[C@H]3CC4=C(C)C[C@]5(CC[C@H]4[C@@H]3CC[C@@H]2C1)O[C@@H]1C[C@H](C)CN[C@H]1[C@H]5C
InChI Key InChIKey=NHQNTVJJVVOJQL-WWGOJCOQSA-N
Data  1 EC50
  Tab Delimited (TSV)   2D SDfile   Computed 3D by Vconf -m prep SDfile
Find this compound or compounds like it in BindingDB:
Activity Spreadsheet -- Enzyme Inhibition Constant Data from BindingDB
Found 1 hit for monomerid = 396278
TargetAlkaline phosphatase, germ cell type(Homo sapiens (Human))
Infinity Pharmaceuticals
US Patent
LigandPNGBDBM396278(US10314827, Compound 31)
Affinity DataEC50:  60nM. Assay description: C3H10T1/2 cells were plated in 96 wells with a density of 8×103 cells/well. Cells were grown to confluence (72 hrs). After sonic Hedgehog (250 ng/ml)...
Ligand InfoPC cidPC sid
In DepthDetails US Patent