BDBM396333 US9980929, Example 31
SMILES CC(C)[C@H](NC(=O)[C@@H](NC(=O)CC(c1ccccc1)c1cccc(Cl)c1)c1ccc(Cl)cc1)C(=O)C(F)(F)F
InChI Key InChIKey=AQXKFQKIRWSEPL-HUASTKEASA-N
Data  1 IC50
  Tab Delimited (TSV)   2D SDfile   Computed 3D by Vconf -m prep SDfile
Find this compound or compounds like it in BindingDB:
Activity Spreadsheet -- Enzyme Inhibition Constant Data from BindingDB
Found 1 hit for monomerid = 396333
TargetSerine protease HTRA1(Homo sapiens (Human))
Hoffmann-La Roche
US Patent
LigandPNGBDBM396333(US9980929, Example 31)
Affinity DataIC50:  65nM. Assay description: Enzyme activity is measured by observing the increase in fluorescence intensity caused by cleavage of a peptide substrate containing a fluorophore, w...
Ligand InfoPC cidPC sid
In DepthDetails US Patent