BDBM396338 US9980929, Example 36
SMILES CC(C)[C@H](NC(=O)[C@@H](NC(=O)C(Oc1cc(Cl)cc(Cl)c1)c1ccccc1)c1ccccc1)C(=O)C(F)(F)F
InChI Key InChIKey=FSYSZJFUFYKGSZ-NTZARQNWSA-N
Data  1 IC50
  Tab Delimited (TSV)   2D SDfile   Computed 3D by Vconf -m prep SDfile
Find this compound or compounds like it in BindingDB:
Activity Spreadsheet -- Enzyme Inhibition Constant Data from BindingDB
Found 1 hit for monomerid = 396338
TargetSerine protease HTRA1(Homo sapiens (Human))
Hoffmann-La Roche
US Patent
LigandPNGBDBM396338(US9980929, Example 36)
Affinity DataIC50:  10nM. Assay description: Enzyme activity is measured by observing the increase in fluorescence intensity caused by cleavage of a peptide substrate containing a fluorophore, w...
Ligand InfoPC cidPC sid
In DepthDetails US Patent